BDBM50025838 (+/-)-2-Amino-1,2,3,4-tetrahydro-2-naphthoic acid::2-Amino-1,2,3,4-tetrahydro-naphthalene-2-carboxylic acid::CHEMBL8708
SMILES NC1(CCc2ccccc2C1)C(O)=O
InChI Key InChIKey=CDULPPOISZOUTK-UHFFFAOYSA-N
Data  1 KI
  Tab Delimited (TSV)   2D SDfile   Computed 3D by Vconf -m prep SDfile
Find this compound or compounds like it in BindingDB:
Activity Spreadsheet -- Enzyme Inhibition Constant Data from BindingDB
Found 1 hit for monomerid = 50025838
TargetLarge neutral amino acids transporter small subunit 1(Rattus norvegicus)
University Of Kentucky
Curated by ChEMBL
LigandPNGBDBM50025838((+/-)-2-Amino-1,2,3,4-tetrahydro-2-naphthoic acid ...)
Affinity DataKi:  7.70E+3nM. Assay description: Inhibition of LAT1-mediated L-[14C]-leucine uptake in Sprague-Dawley rat brain by duel-labeled liquid scintillation counting
In DepthDetails ArticlePubMed