BDBM50025959 5-Imidazo[1,5-a]pyridin-5-yl-pentanoic acid::CHEMBL443001
SMILES OC(=O)CCCCc1cccc2cncn12
InChI Key InChIKey=OFBAVZPPALTAJQ-UHFFFAOYSA-N
Data  1 IC50
  Tab Delimited (TSV)   2D SDfile   Computed 3D by Vconf -m prep SDfile
Find this compound or compounds like it in BindingDB:
Activity Spreadsheet -- Enzyme Inhibition Constant Data from BindingDB
Found 1 hit for monomerid = 50025959
TargetThromboxane-A synthase(Homo sapiens (Human))
TBA
Curated by ChEMBL
LigandPNGBDBM50025959(5-Imidazo[1,5-a]pyridin-5-yl-pentanoic acid | CHEM...)
Affinity DataIC50:  41nM. Assay description: In vitro inhibition of thromboxane A2 synthetase from human platelets.
In DepthDetails ArticlePubMed