BDBM50026012 2-Acetylamino-3-phenyl-N-thiocarbamoylmethyl-propionamide::CHEMBL12826
SMILES CC(=O)NC(Cc1ccccc1)C(=O)NCC(N)=S
InChI Key InChIKey=BFBASVWDVVRNHC-UHFFFAOYSA-N
Data  1 KI
  Tab Delimited (TSV)   2D SDfile   Computed 3D by Vconf -m prep SDfile
Find this compound or compounds like it in BindingDB:
Activity Spreadsheet -- Enzyme Inhibition Constant Data from BindingDB
Found 1 hit for monomerid = 50026012
TargetPapain(Carica papaya)
TBA
Curated by ChEMBL
LigandPNGBDBM50026012(2-Acetylamino-3-phenyl-N-thiocarbamoylmethyl-propi...)
Affinity DataKi:  9.50E+4nM. Assay description: Compound was tested for Inhibition of Papain
In DepthDetails ArticlePubMed