BDBM50026183 2-Thiophen-3-yl-allylamine::CHEMBL108921
SMILES NCC(=C)c1ccsc1
InChI Key InChIKey=MJZFHGILSSSGFK-UHFFFAOYSA-N
Data  1 KI
  Tab Delimited (TSV)   2D SDfile   Computed 3D by Vconf -m prep SDfile
Find this compound or compounds like it in BindingDB:
Activity Spreadsheet -- Enzyme Inhibition Constant Data from BindingDB
Found 1 hit for monomerid = 50026183
TargetDopamine beta-hydroxylase(Bos taurus)
TBA
Curated by ChEMBL
LigandPNGBDBM50026183(2-Thiophen-3-yl-allylamine | CHEMBL108921)
Affinity DataKi:  5.70E+5nM. Assay description: Compound was determined for the kinetic constant against Dopamine beta hydroxylase purified from beef adrenals, inhibitory constant (Ki)
In DepthDetails ArticlePubMed