BDBM50026184 2-Furan-3-yl-allylamine::CHEMBL108927
SMILES NCC(=C)c1ccoc1
InChI Key InChIKey=OBBIFUJGKFYOGT-UHFFFAOYSA-N
Data  1 KI
  Tab Delimited (TSV)   2D SDfile   Computed 3D by Vconf -m prep SDfile
Find this compound or compounds like it in BindingDB:
Activity Spreadsheet -- Enzyme Inhibition Constant Data from BindingDB
Found 1 hit for monomerid = 50026184
TargetDopamine beta-hydroxylase(Bos taurus)
TBA
Curated by ChEMBL
LigandPNGBDBM50026184(2-Furan-3-yl-allylamine | CHEMBL108927)
Affinity DataKi:  2.30E+5nM. Assay description: Compound was determined for the kinetic constant against Dopamine beta hydroxylase purified from beef adrenals, inhibitory constant (Ki)
In DepthDetails ArticlePubMed