BDBM50026503 10-Phenyl-10-pyridin-3-yl-dec-9-enoic acid::CHEMBL101813
SMILES OC(=O)CCCCCCC\C=C(/c1ccccc1)c1cccnc1
InChI Key InChIKey=JUQQBSODJNVOJH-XSFVSMFZSA-N
Data  1 IC50
  Tab Delimited (TSV)   2D SDfile   Computed 3D by Vconf -m prep SDfile
Find this compound or compounds like it in BindingDB:
Activity Spreadsheet -- Enzyme Inhibition Constant Data from BindingDB
Found 1 hit for monomerid = 50026503
TargetThromboxane-A synthase(Homo sapiens (Human))
TBA
Curated by ChEMBL
LigandPNGBDBM50026503(10-Phenyl-10-pyridin-3-yl-dec-9-enoic acid | CHEMB...)
Affinity DataIC50:  32nM. Assay description: Inhibitory activity against thromboxane B2 formation (TXA2 synthase) by incubating prostaglandin H2 (PGH-2) with horse platelet microsomes
In DepthDetails ArticlePubMed