BDBM50026505 (Z)-7-Pyridin-3-yl-7-thiophen-2-yl-hept-6-enoic acid::CHEMBL98282
SMILES OC(=O)CCCC\C=C(/c1cccs1)c1cccnc1
InChI Key InChIKey=XEUQGTFZOOPJDM-AUWJEWJLSA-N
Data  1 IC50
  Tab Delimited (TSV)   2D SDfile   Computed 3D by Vconf -m prep SDfile
Find this compound or compounds like it in BindingDB:
Activity Spreadsheet -- Enzyme Inhibition Constant Data from BindingDB
Found 1 hit for monomerid = 50026505
TargetThromboxane-A synthase(Homo sapiens (Human))
TBA
Curated by ChEMBL
LigandPNGBDBM50026505((Z)-7-Pyridin-3-yl-7-thiophen-2-yl-hept-6-enoic ac...)
Affinity DataIC50:  54nM. Assay description: Inhibitory activity against thromboxane B2 formation (TXA2 synthase) by incubating prostaglandin H2 (PGH-2) with horse platelet microsomes
In DepthDetails ArticlePubMed