BDBM50026517 (Z)-7-Naphthalen-2-yl-7-pyridin-3-yl-hept-6-enoic acid::CHEMBL264871
SMILES OC(=O)CCCC\C=C(/c1cccnc1)c1ccc2ccccc2c1
InChI Key InChIKey=SEQKJPMEJZPHPM-FBHDLOMBSA-N
Data  1 IC50
  Tab Delimited (TSV)   2D SDfile   Computed 3D by Vconf -m prep SDfile
Find this compound or compounds like it in BindingDB:
Activity Spreadsheet -- Enzyme Inhibition Constant Data from BindingDB
Found 1 hit for monomerid = 50026517
TargetThromboxane-A synthase(Homo sapiens (Human))
TBA
Curated by ChEMBL
LigandPNGBDBM50026517((Z)-7-Naphthalen-2-yl-7-pyridin-3-yl-hept-6-enoic ...)
Affinity DataIC50:  60nM. Assay description: Inhibitory activity against thromboxane B2 formation (TXA2 synthase) by incubating prostaglandin H2 (PGH-2) with horse platelet microsomes
In DepthDetails ArticlePubMed