BDBM50026531 2,2-Dimethyl-7-pyridin-3-yl-7-thiophen-2-yl-hept-6-enoic acid::CHEMBL98477
SMILES CC(C)(CCC\C=C(/c1cccs1)c1cccnc1)C(O)=O
InChI Key InChIKey=GHLGYKHZQGQNMQ-NVNXTCNLSA-N
Data  1 IC50
  Tab Delimited (TSV)   2D SDfile   Computed 3D by Vconf -m prep SDfile
Find this compound or compounds like it in BindingDB:
Activity Spreadsheet -- Enzyme Inhibition Constant Data from BindingDB
Found 1 hit for monomerid = 50026531
TargetThromboxane-A synthase(Homo sapiens (Human))
TBA
Curated by ChEMBL
LigandPNGBDBM50026531(2,2-Dimethyl-7-pyridin-3-yl-7-thiophen-2-yl-hept-6...)
Affinity DataIC50:  18nM. Assay description: Inhibitory activity against thromboxane B2 formation (TXA2 synthase) by incubating prostaglandin H2 (PGH-2) with horse platelet microsomes
In DepthDetails ArticlePubMed