BDBM50026533 2-(1-Hydroxy-cyclopentyl)-7-phenyl-7-pyridin-3-yl-hept-6-enoic acid::CHEMBL318048
SMILES OC(=O)C(CCC\C=C(/c1ccccc1)c1cccnc1)C1(O)CCCC1
InChI Key InChIKey=RMGIQMMAMCZIQM-UDWIEESQSA-N
Data  1 IC50
  Tab Delimited (TSV)   2D SDfile   Computed 3D by Vconf -m prep SDfile
Find this compound or compounds like it in BindingDB:
Activity Spreadsheet -- Enzyme Inhibition Constant Data from BindingDB
Found 1 hit for monomerid = 50026533
TargetThromboxane-A synthase(Homo sapiens (Human))
TBA
Curated by ChEMBL
LigandPNGBDBM50026533(2-(1-Hydroxy-cyclopentyl)-7-phenyl-7-pyridin-3-yl-...)
Affinity DataIC50:  65nM. Assay description: Inhibitory activity against thromboxane B2 formation (TXA2 synthase) by incubating prostaglandin H2 (PGH-2) with horse platelet microsomes
In DepthDetails ArticlePubMed