BDBM50026539 11-Phenyl-11-pyridin-3-yl-undec-10-enoic acid::CHEMBL98601
SMILES OC(=O)CCCCCCCC\C=C(/c1ccccc1)c1cccnc1
InChI Key InChIKey=OILGTIRDDCJSRB-RCCKNPSSSA-N
Data  1 IC50
  Tab Delimited (TSV)   2D SDfile   Computed 3D by Vconf -m prep SDfile
Find this compound or compounds like it in BindingDB:
Activity Spreadsheet -- Enzyme Inhibition Constant Data from BindingDB
Found 1 hit for monomerid = 50026539
TargetThromboxane-A synthase(Homo sapiens (Human))
TBA
Curated by ChEMBL
LigandPNGBDBM50026539(11-Phenyl-11-pyridin-3-yl-undec-10-enoic acid | CH...)
Affinity DataIC50:  42nM. Assay description: Inhibitory activity against thromboxane B2 formation (TXA2 synthase) by incubating prostaglandin H2 (PGH-2) with horse platelet microsomes
In DepthDetails ArticlePubMed