BDBM50026552 2,2-Dimethyl-8-phenyl-8-pyridin-3-yl-oct-7-enoic acid::CHEMBL95554
SMILES CC(C)(CCCC\C=C(/c1ccccc1)c1cccnc1)C(O)=O
InChI Key InChIKey=COXWJDIIGQLOLY-CPNJWEJPSA-N
Data  1 IC50
  Tab Delimited (TSV)   2D SDfile   Computed 3D by Vconf -m prep SDfile
Find this compound or compounds like it in BindingDB:
Activity Spreadsheet -- Enzyme Inhibition Constant Data from BindingDB
Found 1 hit for monomerid = 50026552
TargetThromboxane-A synthase(Homo sapiens (Human))
TBA
Curated by ChEMBL
LigandPNGBDBM50026552(2,2-Dimethyl-8-phenyl-8-pyridin-3-yl-oct-7-enoic a...)
Affinity DataIC50:  45nM. Assay description: Inhibitory activity against thromboxane B2 formation (TXA2 synthase) by incubating prostaglandin H2 (PGH-2) with horse platelet microsomes
In DepthDetails ArticlePubMed