BDBM50027090 1N-(11-hydroxy-15-methoxy-3-methyl-13-oxa-3-azahexacyclo[13.2.2.12,8.01,6.06,14.07,12]icosa-7,9,11,18-tetraen-16-yl)-2-bromoacetamide
SMILES CO[C@]12C=C[C@@]3(C[C@@H]1NC(=O)CBr)C1Cc4ccc(O)c5O[C@@H]2C3(CCN1C)c45
InChI Key InChIKey=ACZLURNJNGLBMO-PRKPGHIVSA-N
Data  3 EC50
  Tab Delimited (TSV)   2D SDfile   Computed 3D by Vconf -m prep SDfile
Find this compound or compounds like it in BindingDB:
Activity Spreadsheet -- Enzyme Inhibition Constant Data from BindingDB
Found 3 hits for monomerid = 50027090
TargetDelta-type opioid receptor(Rattus norvegicus (rat))
TBA
Curated by ChEMBL
LigandPNGBDBM50027090(1N-(11-hydroxy-15-methoxy-3-methyl-13-oxa-3-azahex...)
Affinity DataEC50:  50nM. Assay description: The binding affinity was evaluated against [3H]dalamid binding to neuroblastoma X glioma hybrid cell NG108-15 (Opioid receptor delta 1)membranes
In DepthDetails ArticlePubMed
TargetMu-type opioid receptor(Rattus norvegicus (rat))
TBA
Curated by ChEMBL
LigandPNGBDBM50027090(1N-(11-hydroxy-15-methoxy-3-methyl-13-oxa-3-azahex...)
Affinity DataEC50:  70nM. Assay description: The binding affinity was evaluated against [3H]dalamid binding to rat brain membranes (mu opiate receptors).
In DepthDetails ArticlePubMed
TargetDelta-type opioid receptor(Rattus norvegicus (rat))
TBA
Curated by ChEMBL
LigandPNGBDBM50027090(1N-(11-hydroxy-15-methoxy-3-methyl-13-oxa-3-azahex...)
Affinity DataEC50:  70nM. Assay description: The binding affinity was evaluated against [3H]dalamid binding to rat brain membranes (Opioid receptor delta 1)
In DepthDetails ArticlePubMed