BDBM50027129 2,15,17,29-tetrahydroxy-11-methoxy-3,7,12,14,16,18,22-heptamethyl-26-[4-(3-Methoxy-benzyl)-piperazin-1-yl]-methylene-amino-6,23-dioxo-8,30-dioxa-24-azatetracyclo[23.3.1.14,7.05,28]triaconta-1(28),2,4,9,19,21,25(29),26-octaen-13-yl acetate::CHEMBL89733
SMILES COC1\C=C\OC2(C)Oc3c(C2=O)c2cc(\C=N\N4CCN(Cc5cccc(OC)c5)CC4)c(NC(=O)\C(C)=C/C=C/C(C)C(O)C(C)C(O)C(C)C(OC(C)=O)C1C)c(O)c2c(O)c3C
InChI Key InChIKey=KNTBQFUUAPCRIF-UBNSPBHHSA-N
Data  2 IC50
  Tab Delimited (TSV)   2D SDfile   Computed 3D by Vconf -m prep SDfile
Find this compound or compounds like it in BindingDB:
Activity Spreadsheet -- Enzyme Inhibition Constant Data from BindingDB
Found 2 hits for monomerid = 50027129
TargetGag-Pol polyprotein(Woolly monkey sarcoma virus)
TBA
Curated by ChEMBL
LigandPNGBDBM50027129(2,15,17,29-tetrahydroxy-11-methoxy-3,7,12,14,16,18...)
Affinity DataIC50:  1.00E+4nM. Assay description: Ability to inhibit simian sarcoma virus reverse transcriptase
In DepthDetails ArticlePubMed
TargetDNA polymerase beta(Mus musculus)
TBA
Curated by ChEMBL
LigandPNGBDBM50027129(2,15,17,29-tetrahydroxy-11-methoxy-3,7,12,14,16,18...)
Affinity DataIC50:  1.20E+5nM. Assay description: Ability to inhibit mouse beta DNA polymerase
In DepthDetails ArticlePubMed