BDBM50027182 CHEMBL3335541
SMILES Cc1ccccc1CN1CCOC(CCc2ccccc2)C1
InChI Key InChIKey=VUQABHBLIKWWTH-UHFFFAOYSA-N
Data  1 KI  1 IC50
  Tab Delimited (TSV)   2D SDfile   Computed 3D by Vconf -m prep SDfile
Find this compound or compounds like it in BindingDB:
Activity Spreadsheet -- Enzyme Inhibition Constant Data from BindingDB
Found 2 hits for monomerid = 50027182
TargetD(4) dopamine receptor(Homo sapiens (Human))
Vanderbilt University
Curated by ChEMBL
LigandPNGBDBM50027182(CHEMBL3335541)
Affinity DataKi:  1.02E+3nM. Assay description: Inhibition of human dopamine D4 receptor
In DepthDetails ArticlePubMed
TargetD(4) dopamine receptor(Homo sapiens (Human))
Vanderbilt University
Curated by ChEMBL
LigandPNGBDBM50027182(CHEMBL3335541)
Affinity DataIC50:  3.68E+3nM. Assay description: Inhibition of human dopamine D4 receptor
In DepthDetails ArticlePubMed