BDBM50027257 CHEMBL3335543
SMILES Fc1ccc(CN2CCOC(CCc3ccccc3)C2)cc1
InChI Key InChIKey=JZZPOYFHLLGSFY-UHFFFAOYSA-N
Data  1 KI  1 IC50
  Tab Delimited (TSV)   2D SDfile   Computed 3D by Vconf -m prep SDfile
Find this compound or compounds like it in BindingDB:
Activity Spreadsheet -- Enzyme Inhibition Constant Data from BindingDB
Found 2 hits for monomerid = 50027257
TargetD(4) dopamine receptor(Homo sapiens (Human))
Vanderbilt University
Curated by ChEMBL
LigandPNGBDBM50027257(CHEMBL3335543)
Affinity DataKi:  320nM. Assay description: Inhibition of human dopamine D4 receptor
In DepthDetails ArticlePubMed
TargetD(4) dopamine receptor(Homo sapiens (Human))
Vanderbilt University
Curated by ChEMBL
LigandPNGBDBM50027257(CHEMBL3335543)
Affinity DataIC50:  1.14E+3nM. Assay description: Inhibition of human dopamine D4 receptor
In DepthDetails ArticlePubMed