BDBM50027713 CHEMBL3338527
SMILES Cc1cc(cc(C)c1Oc1cc(Nc2ccc(cc2)C#N)ncc1C(=O)NCC=C)C#N
InChI Key InChIKey=VLMRXBVKOGBJFI-UHFFFAOYSA-N
Data  1 IC50
  Tab Delimited (TSV)   2D SDfile   Computed 3D by Vconf -m prep SDfile
Find this compound or compounds like it in BindingDB:
Activity Spreadsheet -- Enzyme Inhibition Constant Data from BindingDB
Found 1 hit for monomerid = 50027713
TargetReverse transcriptase(Human immunodeficiency virus 1)
Shandong University
Curated by ChEMBL
LigandPNGBDBM50027713(CHEMBL3338527)
Affinity DataIC50:  2.85E+3nM. Assay description: Inhibition of HIV1 reverse transcriptase assessed as reduction in biotin-dUTP incorporation using poly(rA)-oligo(dT) as template/primer and digoxigen...
In DepthDetails ArticlePubMed