BDBM50027723 CHEMBL3338529
SMILES Cc1cc(cc(C)c1Oc1cc(Nc2ccc(cc2)C#N)ncc1C(N)=O)C#N
InChI Key InChIKey=MFBGMZMEEMTPRD-UHFFFAOYSA-N
Data  1 IC50
  Tab Delimited (TSV)   2D SDfile   Computed 3D by Vconf -m prep SDfile
Find this compound or compounds like it in BindingDB:
Activity Spreadsheet -- Enzyme Inhibition Constant Data from BindingDB
Found 1 hit for monomerid = 50027723
TargetReverse transcriptase(Human immunodeficiency virus 1)
Shandong University
Curated by ChEMBL
LigandPNGBDBM50027723(CHEMBL3338529)
Affinity DataIC50:  80nM. Assay description: Inhibition of HIV1 reverse transcriptase assessed as reduction in biotin-dUTP incorporation using poly(rA)-oligo(dT) as template/primer and digoxigen...
In DepthDetails ArticlePubMed