BDBM50027826 CHEMBL3338538
SMILES Cc1cc(C)c(Oc2cc(Nc3ccc(cc3)C#N)ncc2C(=O)NCC=C)c(C)c1
InChI Key InChIKey=UHTDNRCKFUHVJX-UHFFFAOYSA-N
Data  1 IC50
  Tab Delimited (TSV)   2D SDfile   Computed 3D by Vconf -m prep SDfile
Find this compound or compounds like it in BindingDB:
Activity Spreadsheet -- Enzyme Inhibition Constant Data from BindingDB
Found 1 hit for monomerid = 50027826
TargetReverse transcriptase(Human immunodeficiency virus 1)
Shandong University
Curated by ChEMBL
LigandPNGBDBM50027826(CHEMBL3338538)
Affinity DataIC50:  170nM. Assay description: Inhibition of HIV1 reverse transcriptase assessed as reduction in biotin-dUTP incorporation using poly(rA)-oligo(dT) as template/primer and digoxigen...
In DepthDetails ArticlePubMed