BDBM50027876 CHEMBL2348200
SMILES OC(CNCCNC(=O)Nc1ccccc1Cl)COc1ccc(OCCOC2CCCC2)cc1
InChI Key InChIKey=IUXJWQVMGHARRI-UHFFFAOYSA-N
Data  2 Kd
  Tab Delimited (TSV)   2D SDfile   Computed 3D by Vconf -m prep SDfile
Find this compound or compounds like it in BindingDB:
Activity Spreadsheet -- Enzyme Inhibition Constant Data from BindingDB
Found 2 hits for monomerid = 50027876
TargetBeta-2 adrenergic receptor(Homo sapiens (Human))
University Of Nottingham
Curated by ChEMBL
LigandPNGBDBM50027876(CHEMBL2348200)
Affinity DataKd:  2.88E+3nM. Assay description: Displacement of [3H]-CGP12177 from human beta2 adrenoceptor expressed in CHOK1 cells after 2 hrs by scintillation counting analysis
In DepthDetails ArticlePubMed
TargetBeta-1 adrenergic receptor(Homo sapiens (Human))
University Of Nottingham
Curated by ChEMBL
LigandPNGBDBM50027876(CHEMBL2348200)
Affinity DataKd:  78nM. Assay description: Displacement of [3H]-CGP12177 from human beta1 adrenoceptor expressed in CHOK1 cells after 2 hrs by scintillation counting analysis
In DepthDetails ArticlePubMed