BDBM50028293 CHEMBL6459::cis-7-(4-Chloro-phenyl)-2-methyl-1,3,4,6,7,11b-hexahydro-2H-pyrazino[2,1-a]isoquinoline
SMILES CN1CCN2CC(c3ccc(Cl)cc3)c3ccccc3C2C1
InChI Key InChIKey=ZCOWQICYITYASE-UHFFFAOYSA-N
Data  1 IC50
  Tab Delimited (TSV)   2D SDfile   Computed 3D by Vconf -m prep SDfile
Find this compound or compounds like it in BindingDB:
Activity Spreadsheet -- Enzyme Inhibition Constant Data from BindingDB
Found 1 hit for monomerid = 50028293
LigandPNGBDBM50028293(CHEMBL6459 | cis-7-(4-Chloro-phenyl)-2-methyl-1,3,...)
Affinity DataIC50:  900nM. Assay description: Binding affinity towards muscarinic acetylcholine receptor by inhibiting specific binding of [3H]-quinuclidinyl benzilate (0.8 nM) in vitro to membra...
In DepthDetails ArticlePubMed