BDBM50028299 CHEMBL6482::cis-2-Butyl-7-phenyl-1,3,4,6,7,11b-hexahydro-2H-pyrazino[2,1-a]isoquinoline
SMILES CCCCN1CCN2CC(c3ccccc3)c3ccccc3C2C1
InChI Key InChIKey=BKFAIRPZGSVHAL-UHFFFAOYSA-N
Data  1 IC50
  Tab Delimited (TSV)   2D SDfile   Computed 3D by Vconf -m prep SDfile
Find this compound or compounds like it in BindingDB:
Activity Spreadsheet -- Enzyme Inhibition Constant Data from BindingDB
Found 1 hit for monomerid = 50028299
LigandPNGBDBM50028299(CHEMBL6482 | cis-2-Butyl-7-phenyl-1,3,4,6,7,11b-he...)
Affinity DataIC50:  1.80E+4nM. Assay description: Binding affinity towards muscarinic acetylcholine receptor by inhibiting specific binding of [3H]-quinuclidinyl benzilate (0.8 nM) in vitro to membra...
In DepthDetails ArticlePubMed