BDBM50028586 1-(4-Benzyloxy-5-hydroxymethyl-tetrahydro-furan-2-yl)-5-methyl-1H-pyrimidine-2,4-dione::CHEMBL3143486
SMILES Cc1cn([C@H]2C[C@H](OCc3ccccc3)[C@@H](CO)O2)c(=O)[nH]c1=O
InChI Key InChIKey=NGGASHOTQGRVLP-UHFFFAOYSA-N
Data  2 KI
  Tab Delimited (TSV)   2D SDfile   Computed 3D by Vconf -m prep SDfile
Find this compound or compounds like it in BindingDB:
Activity Spreadsheet -- Enzyme Inhibition Constant Data from BindingDB
Found 2 hits for monomerid = 50028586
TargetThymidine kinase 2, mitochondrial (Predicted)(Rattus norvegicus)
TBA
Curated by ChEMBL
LigandPNGBDBM50028586(1-(4-Benzyloxy-5-hydroxymethyl-tetrahydro-furan-2-...)
Affinity DataKi:  8.00E+3nM. Assay description: Competitive inhibition against rat mitochondrial thymidine kinase
In DepthDetails ArticlePubMed
TargetThymidine kinase, cytosolic(Rattus norvegicus)
TBA
Curated by ChEMBL
LigandPNGBDBM50028586(1-(4-Benzyloxy-5-hydroxymethyl-tetrahydro-furan-2-...)
Affinity DataKi:  1.20E+4nM. Assay description: Competitive inhibition against rat cytoplasmic thymidine kinase
In DepthDetails ArticlePubMed