BDBM50029307 N-{3-[4-(2-Isopropoxy-phenyl)-piperazin-1-ylmethyl]-benzyl}-methanesulfonamide with 0.5M of succinic acid
SMILES CC(C)Oc1ccccc1N1CCN(Cc2cccc(CNS(C)(=O)=O)c2)CC1
InChI Key InChIKey=BPTUUGKAWBQQFL-UHFFFAOYSA-N
Data  2 KI
  Tab Delimited (TSV)   2D SDfile   Computed 3D by Vconf -m prep SDfile
Find this compound or compounds like it in BindingDB:
Activity Spreadsheet -- Enzyme Inhibition Constant Data from BindingDB
Found 2 hits for monomerid = 50029307
Target5-hydroxytryptamine receptor 1A(Rattus norvegicus (rat))
R. W. Johnson Pharmaceutical Research Institute
Curated by ChEMBL
LigandPNGBDBM50029307(N-{3-[4-(2-Isopropoxy-phenyl)-piperazin-1-ylmethyl...)
Affinity DataKi:  12nM. Assay description: Affinity against the 5-hydroxytryptamine receptor 1A using [3H]WB-4101.
In DepthDetails ArticlePubMed
TargetD(2) dopamine receptor(Rattus norvegicus (rat))
R. W. Johnson Pharmaceutical Research Institute
Curated by ChEMBL
LigandPNGBDBM50029307(N-{3-[4-(2-Isopropoxy-phenyl)-piperazin-1-ylmethyl...)
Affinity DataKi:  31nM. Assay description: Affinity against the dopamine receptor D2 using [3H]spiperinone.
In DepthDetails ArticlePubMed