BDBM50030982 5-(4-Nitro-benzyl)-1H-pyrimidine-2,4-dione::CHEMBL340318
SMILES [O-][N+](=O)c1ccc(Cc2c[n-]c(=[OH+])[nH]c2=O)cc1
InChI Key InChIKey=BYMQTBCOJXZMED-UHFFFAOYSA-N
Data  1 IC50
  Tab Delimited (TSV)   2D SDfile   Computed 3D by Vconf -m prep SDfile
Find this compound or compounds like it in BindingDB:
Activity Spreadsheet -- Enzyme Inhibition Constant Data from BindingDB
Found 1 hit for monomerid = 50030982
TargetUridine phosphorylase 1(Mus musculus)
Burroughs Wellcome
Curated by ChEMBL
LigandPNGBDBM50030982(5-(4-Nitro-benzyl)-1H-pyrimidine-2,4-dione | CHEMB...)
Affinity DataIC50:  5.90E+3nM. Assay description: Inhibition of uridine phosphorylase (UrdPase) from murine liver.
In DepthDetails ArticlePubMed