BDBM50030995 5-(3-Butoxy-benzyl)-1-(2-hydroxy-ethoxymethyl)-1H-pyrimidine-2,4-dione::CHEMBL123971
SMILES CCCCOc1cccc(Cc2cn(COCCO)c(=O)[nH]c2=O)c1
InChI Key InChIKey=XJVHEQVQHPSZGU-UHFFFAOYSA-N
Data  1 IC50
  Tab Delimited (TSV)   2D SDfile   Computed 3D by Vconf -m prep SDfile
Find this compound or compounds like it in BindingDB:
Activity Spreadsheet -- Enzyme Inhibition Constant Data from BindingDB
Found 1 hit for monomerid = 50030995
TargetUridine phosphorylase 1(Mus musculus)
Burroughs Wellcome
Curated by ChEMBL
LigandPNGBDBM50030995(5-(3-Butoxy-benzyl)-1-(2-hydroxy-ethoxymethyl)-1H-...)
Affinity DataIC50:  160nM. Assay description: Inhibition of uridine phosphorylase (UrdPase) from murine liver.
In DepthDetails ArticlePubMed