BDBM50030997 5-(3-Methoxy-benzyl)-1H-pyrimidine-2,4-dione::CHEMBL446113
SMILES COc1cccc(Cc2c[nH]c(=O)[nH]c2=O)c1
InChI Key InChIKey=NOFPXZXTKXPRDN-UHFFFAOYSA-N
Data  1 IC50
  Tab Delimited (TSV)   2D SDfile   Computed 3D by Vconf -m prep SDfile
Find this compound or compounds like it in BindingDB:
Activity Spreadsheet -- Enzyme Inhibition Constant Data from BindingDB
Found 1 hit for monomerid = 50030997
TargetUridine phosphorylase 1(Mus musculus)
Burroughs Wellcome
Curated by ChEMBL
LigandPNGBDBM50030997(5-(3-Methoxy-benzyl)-1H-pyrimidine-2,4-dione | CHE...)
Affinity DataIC50:  3.90E+3nM. Assay description: Inhibition of uridine phosphorylase (UrdPase) from murine liver.
In DepthDetails ArticlePubMed