BDBM50031000 5-(3-sec-Butoxy-benzyl)-1H-pyrimidine-2,4-dione::CHEMBL339247
SMILES CCC(C)Oc1cccc(Cc2c[nH]c(=O)[nH]c2=O)c1
InChI Key InChIKey=VXLKLBJWLOIORX-UHFFFAOYSA-N
Data  1 IC50
  Tab Delimited (TSV)   2D SDfile   Computed 3D by Vconf -m prep SDfile
Find this compound or compounds like it in BindingDB:
Activity Spreadsheet -- Enzyme Inhibition Constant Data from BindingDB
Found 1 hit for monomerid = 50031000
TargetUridine phosphorylase 1(Mus musculus)
Burroughs Wellcome
Curated by ChEMBL
LigandPNGBDBM50031000(5-(3-sec-Butoxy-benzyl)-1H-pyrimidine-2,4-dione | ...)
Affinity DataIC50:  1.10E+3nM. Assay description: Inhibition of uridine phosphorylase (UrdPase) from murine liver.
In DepthDetails ArticlePubMed