BDBM50031013 5-(3-Fluoro-benzyl)-1H-pyrimidine-2,4-dione::CHEMBL126531
SMILES Fc1cccc(Cc2c[nH]c(=O)[nH]c2=O)c1
InChI Key InChIKey=CBKNUEKHNYDAGI-UHFFFAOYSA-N
Data  1 IC50
  Tab Delimited (TSV)   2D SDfile   Computed 3D by Vconf -m prep SDfile
Find this compound or compounds like it in BindingDB:
Activity Spreadsheet -- Enzyme Inhibition Constant Data from BindingDB
Found 1 hit for monomerid = 50031013
TargetUridine phosphorylase 1(Mus musculus)
Burroughs Wellcome
Curated by ChEMBL
LigandPNGBDBM50031013(5-(3-Fluoro-benzyl)-1H-pyrimidine-2,4-dione | CHEM...)
Affinity DataIC50:  7.60E+3nM. Assay description: Inhibition of uridine phosphorylase (UrdPase) from murine liver.
In DepthDetails ArticlePubMed