BDBM50031017 5-(2-Chloro-benzyl)-1H-pyrimidine-2,4-dione::CHEMBL127529
SMILES Clc1ccccc1Cc1c[nH]c(=O)[nH]c1=O
InChI Key InChIKey=CPQAZTSRWAQRAQ-UHFFFAOYSA-N
Data  1 IC50
  Tab Delimited (TSV)   2D SDfile   Computed 3D by Vconf -m prep SDfile
Find this compound or compounds like it in BindingDB:
Activity Spreadsheet -- Enzyme Inhibition Constant Data from BindingDB
Found 1 hit for monomerid = 50031017
TargetUridine phosphorylase 1(Mus musculus)
Burroughs Wellcome
Curated by ChEMBL
LigandPNGBDBM50031017(5-(2-Chloro-benzyl)-1H-pyrimidine-2,4-dione | CHEM...)
Affinity DataIC50:  2.40E+4nM. Assay description: Inhibition of uridine phosphorylase (UrdPase) from murine liver.
In DepthDetails ArticlePubMed