BDBM50032660 CHEMBL3354660
SMILES COc1ccc(cc1)-c1c(\C=C\C(=O)N2CCN(CC2)c2cccc(OC)c2)noc1-c1cc(Cl)c(O)cc1O
InChI Key InChIKey=YJJKWAZEMDORLO-ZHACJKMWSA-N
Data  1 IC50
  Tab Delimited (TSV)   2D SDfile   Computed 3D by Vconf -m prep SDfile
Find this compound or compounds like it in BindingDB:
Activity Spreadsheet -- Enzyme Inhibition Constant Data from BindingDB
Found 1 hit for monomerid = 50032660
Target[Pyruvate dehydrogenase (acetyl-transferring)] kinase isozyme 1, mitochondrial(Homo sapiens (Human))
Chinese Academy Of Sciences
Curated by ChEMBL
LigandPNGBDBM50032660(CHEMBL3354660)
Affinity DataIC50:  491nM. Assay description: Inhibition of recombinant PDHK1 (unknown origin) expressed in Escherichia coli incubated for 1 hr by ELISA
In DepthDetails ArticlePubMed