BDBM50033966 CHEMBL11267::N-[5-[(1H,9H-dibenzo[4,5:8,9] [1,3]dioxonino[6,7-d]imidazol-2-yl)thio]pentyl]-N`-(2,4-difluorophenyl)-N-heptylurea
SMILES CCCCCCCN(CCCCCSc1nc-2c([nH]1)-c1ccccc1OCOc1ccccc-21)C(=O)Nc1ccc(F)cc1F
InChI Key InChIKey=CJGCUCYNYNHHAJ-UHFFFAOYSA-N
Data  1 IC50
  Tab Delimited (TSV)   2D SDfile   Computed 3D by Vconf -m prep SDfile
Find this compound or compounds like it in BindingDB:
Activity Spreadsheet -- Enzyme Inhibition Constant Data from BindingDB
Found 1 hit for monomerid = 50033966
TargetSterol O-acyltransferase 1(Rattus norvegicus)
Dupont Pharmaceuticals
Curated by ChEMBL
LigandPNGBDBM50033966(CHEMBL11267 | N-[5-[(1H,9H-dibenzo[4,5:8,9] [1,3]d...)
Affinity DataIC50:  30nM. Assay description: Concentration required to inhibit 50% activity of Acyl coenzyme A:cholesterol acyltransferase 1 in vitro using rat liver microsome.
In DepthDetails ArticlePubMed