BDBM50034200 (4-Fluoro-phenyl)-[1-(4-phenyl-butyl)-piperidin-4-yl]-methanol::CHEMBL18904
SMILES OC(C1CCN(CCCCc2ccccc2)CC1)c1ccc(F)cc1
InChI Key InChIKey=VDIAGIXWYFPSJN-UHFFFAOYSA-N
Data  3 KI
  Tab Delimited (TSV)   2D SDfile   Computed 3D by Vconf -m prep SDfile
Find this compound or compounds like it in BindingDB:
Activity Spreadsheet -- Enzyme Inhibition Constant Data from BindingDB
Found 3 hits for monomerid = 50034200
Target5-hydroxytryptamine receptor 2A(Rattus norvegicus (rat))
Virginia Commonwealth University
Curated by ChEMBL
LigandPNGBDBM50034200((4-Fluoro-phenyl)-[1-(4-phenyl-butyl)-piperidin-4-...)
Affinity DataKi:  126nM. Assay description: Binding affinity against 5-hydroxytryptamine 2A receptor
In DepthDetails ArticlePubMed
Target5-hydroxytryptamine receptor 2A(Homo sapiens (Human))
Merck Sharp And Dohme Research Laboratories
Curated by ChEMBL
LigandPNGBDBM50034200((4-Fluoro-phenyl)-[1-(4-phenyl-butyl)-piperidin-4-...)
Affinity DataKi:  126nM. Assay description: Binding affinity for human 5-hydroxytryptamine 2A receptor
In DepthDetails ArticlePubMed
Target5-hydroxytryptamine receptor 2C(Rattus norvegicus (Rat))
Virginia Commonwealth University
Curated by ChEMBL
LigandPNGBDBM50034200((4-Fluoro-phenyl)-[1-(4-phenyl-butyl)-piperidin-4-...)
Affinity DataKi:  6.60E+3nM. Assay description: Binding affinity against 5-hydroxytryptamine 2C receptor
In DepthDetails ArticlePubMed