BDBM50035300 1-(8-Dipropylamino-4-fluoro-6,7,8,9-tetrahydro-3H-benzo[e]indol-1-yl)-propan-1-one::CHEMBL70985
SMILES CCCN(CCC)C1CCc2cc(F)c3[nH]cc(C(=O)CC)c3c2C1
InChI Key InChIKey=UTKHSRGDDNRWQN-UHFFFAOYSA-N
Data  4 KI
  Tab Delimited (TSV)   2D SDfile   Computed 3D by Vconf -m prep SDfile
Find this compound or compounds like it in BindingDB:
Activity Spreadsheet -- Enzyme Inhibition Constant Data from BindingDB
Found 4 hits for monomerid = 50035300
Target5-hydroxytryptamine receptor 1A(Rattus norvegicus (rat))
GöTeborg University
Curated by ChEMBL
LigandPNGBDBM50035300(1-(8-Dipropylamino-4-fluoro-6,7,8,9-tetrahydro-3H-...)
Affinity DataKi:  7.10nM. Assay description: Binding affinity against 5-hydroxytryptamine 1A receptor from CHO-K1 cells, using [3H]-8-OH-DPAT as the radioligand.
In DepthDetails ArticlePubMed
Target5-hydroxytryptamine receptor 1D(Homo sapiens (Human))
GöTeborg University
Curated by ChEMBL
LigandPNGBDBM50035300(1-(8-Dipropylamino-4-fluoro-6,7,8,9-tetrahydro-3H-...)
Affinity DataKi:  36nM. Assay description: Binding affinity against 5-hydroxytryptamine 1D receptor alpha expressed in CHO-K1 cells, using [3H]-5-HT as the radioligand.
In DepthDetails ArticlePubMed
TargetD(2) dopamine receptor(Rattus norvegicus (rat))
GöTeborg University
Curated by ChEMBL
LigandPNGBDBM50035300(1-(8-Dipropylamino-4-fluoro-6,7,8,9-tetrahydro-3H-...)
Affinity DataKi:  377nM. Assay description: Binding affinity against Dopamine receptor D2 from CHO-K1 cells, using [3H]-U-86,170 as the radioligand.
In DepthDetails ArticlePubMed
TargetD(3) dopamine receptor(Rattus norvegicus (Rat))
GöTeborg University
Curated by ChEMBL
LigandPNGBDBM50035300(1-(8-Dipropylamino-4-fluoro-6,7,8,9-tetrahydro-3H-...)
Affinity DataKi:  542nM. Assay description: Binding affinity against Dopamine receptor D3 from CHO-K1 cells, using [3H]-spiperone as the radioligand.
In DepthDetails ArticlePubMed