BDBM50035503 (S)-1-((S)-2-Amino-3-methyl-butyryl)-pyrrolidine-2-carboxylic acid (3,3,4,4,4-pentafluoro-1-isopropyl-2-oxo-butyl)-amide; hydrochloride::CHEMBL2372359
SMILES Cl.CC(C)[C@H](N)C(=O)N1CCC[C@H]1C(=O)N[C@@H](C(C)C)C(=O)C(F)(F)C(F)(F)F
InChI Key InChIKey=WJSBXSMQUOXTJG-LFELFHSZSA-N
Data  1 KI
  Tab Delimited (TSV)   2D SDfile   Computed 3D by Vconf -m prep SDfile
Find this compound or compounds like it in BindingDB:
Activity Spreadsheet -- Enzyme Inhibition Constant Data from BindingDB
Found 1 hit for monomerid = 50035503
TargetNeutrophil elastase(Homo sapiens (Human))
Marion Merrell Dow Research Institute
Curated by ChEMBL
LigandPNGBDBM50035503((S)-1-((S)-2-Amino-3-methyl-butyryl)-pyrrolidine-2...)
Affinity DataKi:  1.20E+3nM. Assay description: In vitro inhibition of human neutrophil elastase
In DepthDetails ArticlePubMed