BDBM50035529 CHEMBL74545::{(S)-2-Methyl-1-[(S)-2-(3,3,4,4,4-pentafluoro-1,1-dimethyl-2-oxo-butylcarbamoyl)-pyrrolidine-1-carbonyl]-propyl}-carbamic acid tert-butyl ester
SMILES CC(C)[C@H](NC(=O)OC(C)(C)C)C(=O)N1CCC[C@H]1C(=O)NC(C)(C)C(=O)C(F)(F)C(F)(F)F
InChI Key InChIKey=BANIVQUQRTYNPA-STQMWFEESA-N
Data  1 KI
  Tab Delimited (TSV)   2D SDfile   Computed 3D by Vconf -m prep SDfile
Find this compound or compounds like it in BindingDB:
Activity Spreadsheet -- Enzyme Inhibition Constant Data from BindingDB
Found 1 hit for monomerid = 50035529
TargetNeutrophil elastase(Homo sapiens (Human))
Marion Merrell Dow Research Institute
Curated by ChEMBL
LigandPNGBDBM50035529(CHEMBL74545 | {(S)-2-Methyl-1-[(S)-2-(3,3,4,4,4-pe...)
Affinity DataKi: >5.00E+5nM. Assay description: Binding affinity of the compound for purified Human neutrophil elastase was determined in vitro.
In DepthDetails ArticlePubMed