BDBM50035533 Acetic acid (E)-3-methyl-2-[((S)-1-{(S)-3-methyl-2-[(morpholine-4-carbonyl)-amino]-butyryl}-pyrrolidine-2-carbonyl)-amino]-1-trifluoromethyl-but-1-enyl ester::CHEMBL77915
SMILES CC(C)[C@H](NC(=O)N1CCOCC1)C(=O)N1CCC[C@H]1C(=O)N\C(C(C)C)=C(\OC(C)=O)C(F)(F)F
InChI Key InChIKey=IRHCVAKIIIJENN-ASLOAULGSA-N
Data  2 KI
  Tab Delimited (TSV)   2D SDfile   Computed 3D by Vconf -m prep SDfile
Find this compound or compounds like it in BindingDB:
Activity Spreadsheet -- Enzyme Inhibition Constant Data from BindingDB
Found 2 hits for monomerid = 50035533
TargetNeutrophil elastase(Homo sapiens (Human))
Marion Merrell Dow Research Institute
Curated by ChEMBL
LigandPNGBDBM50035533(Acetic acid (E)-3-methyl-2-[((S)-1-{(S)-3-methyl-2...)
Affinity DataKi:  6.30E+3nM. Assay description: Binding affinity of the compound for purified Human neutrophil elastase was determined in vitro.
In DepthDetails ArticlePubMed
TargetNeutrophil elastase(Homo sapiens (Human))
Marion Merrell Dow Research Institute
Curated by ChEMBL
LigandPNGBDBM50035533(Acetic acid (E)-3-methyl-2-[((S)-1-{(S)-3-methyl-2...)
Affinity DataKi:  6.30E+3nM. Assay description: Binding affinity of the compound for purified Human neutrophil elastase was determined in vitro.
In DepthDetails ArticlePubMed