BDBM50036130 8-ethyl-8-hydroxy-15-(4-methylhexahydro-1-pyrazinylmethyl)-(8S)-2,3,8,9,12,14-hexahydro-11H-[1,4]dioxino[2,3-g]pyrano[3',4':6,7]indolizino[1,2-b]quinoline-9,12-dione with trifluoroaceticacid::CHEMBL341028
SMILES CC[C@@]1(O)C(=O)OCc2c1cc1-c3nc4cc5OCCOc5cc4c(CN4CCN(C)CC4)c3Cn1c2=O
InChI Key InChIKey=RVFGKBWWUQOIOU-NDEPHWFRSA-N
Data  1 IC50
  Tab Delimited (TSV)   2D SDfile   Computed 3D by Vconf -m prep SDfile
Find this compound or compounds like it in BindingDB:
Activity Spreadsheet -- Enzyme Inhibition Constant Data from BindingDB
Found 1 hit for monomerid = 50036130
TargetDNA topoisomerase 1(Homo sapiens (Human))
Glaxo Research Institute
Curated by ChEMBL
LigandPNGBDBM50036130(8-ethyl-8-hydroxy-15-(4-methylhexahydro-1-pyraziny...)
Affinity DataIC50:  416nM. Assay description: Inhibition of topoisomerase I activity was determined in vitro by using the cleavable complex assay(calf thymus)
In DepthDetails ArticlePubMed