BDBM50036708 CHEMBL3354813
SMILES CN[C@@H]1CCN(C1)c1cc(N)nc(n1)C(C)C
InChI Key InChIKey=KXSAVRSIQRTDOC-SECBINFHSA-N
Data  1 KI
  Tab Delimited (TSV)   2D SDfile   Computed 3D by Vconf -m prep SDfile
Find this compound or compounds like it in BindingDB:
Activity Spreadsheet -- Enzyme Inhibition Constant Data from BindingDB
Found 1 hit for monomerid = 50036708
TargetHistamine H4 receptor(Homo sapiens (Human))
Janssen Research And Development
Curated by ChEMBL
LigandPNGBDBM50036708(CHEMBL3354813)
Affinity DataKi:  320nM. Assay description: Displacement of [3H]histamine from human recombinant histamine H4 receptor
In DepthDetails ArticlePubMed