BDBM50036744 CHEMBL3354807
SMILES CCc1cc(ncn1)N1CC[C@H](C1)NC
InChI Key InChIKey=RKEAGPVGAFOKGG-SNVBAGLBSA-N
Data  1 KI
  Tab Delimited (TSV)   2D SDfile   Computed 3D by Vconf -m prep SDfile
Find this compound or compounds like it in BindingDB:
Activity Spreadsheet -- Enzyme Inhibition Constant Data from BindingDB
Found 1 hit for monomerid = 50036744
TargetHistamine H4 receptor(Homo sapiens (Human))
Janssen Research And Development
Curated by ChEMBL
LigandPNGBDBM50036744(CHEMBL3354807)
Affinity DataKi:  456nM. Assay description: Displacement of [3H]histamine from human recombinant histamine H4 receptor
In DepthDetails ArticlePubMed