BDBM50036854 1-(5-Methoxy-chroman-3-yl)-pyrrolidine::CHEMBL285010
SMILES COc1cccc2OCC(Cc12)N1CCCC1
InChI Key InChIKey=HDUPNKAXLWKEFD-UHFFFAOYSA-N
Data  1 KI  7 IC50
  Tab Delimited (TSV)   2D SDfile   Computed 3D by Vconf -m prep SDfile
Find this compound or compounds like it in BindingDB:
Activity Spreadsheet -- Enzyme Inhibition Constant Data from BindingDB
Found 8 hits for monomerid = 50036854
Target5-hydroxytryptamine receptor 1A(Rattus norvegicus (rat))
Universit£
Curated by ChEMBL
LigandPNGBDBM50036854(1-(5-Methoxy-chroman-3-yl)-pyrrolidine | CHEMBL285...)
Affinity DataKi:  3.5nM. Assay description: Binding affinity of a compound to rat brain 5-hydroxytryptamine 1A (serotonin) receptor assayed by radiolabeled [3H]-8-OH-DPAT ligand displacement
In DepthDetails ArticlePubMed
Target5-hydroxytryptamine receptor 2A(BOVINE)
Universit£
Curated by ChEMBL
LigandPNGBDBM50036854(1-(5-Methoxy-chroman-3-yl)-pyrrolidine | CHEMBL285...)
Affinity DataIC50:  6.00E+4nM. Assay description: Binding affinity towards 5-hydroxytryptamine 2 receptor in calf frontal cortex
In DepthDetails ArticlePubMed
TargetAlpha-1A adrenergic receptor(CALF)
Universit£
Curated by ChEMBL
LigandPNGBDBM50036854(1-(5-Methoxy-chroman-3-yl)-pyrrolidine | CHEMBL285...)
Affinity DataIC50:  4.00E+4nM. Assay description: Binding affinity against alpha-1 adrenergic receptor in calf frontal cortex
In DepthDetails ArticlePubMed
TargetD(1A) dopamine receptor(BOVINE)
Universit£
Curated by ChEMBL
LigandPNGBDBM50036854(1-(5-Methoxy-chroman-3-yl)-pyrrolidine | CHEMBL285...)
Affinity DataIC50:  1.00E+6nM. Assay description: Binding affinity towards dopamine receptor D1 in calf striatum
In DepthDetails ArticlePubMed
Target5-hydroxytryptamine receptor 1B(Rattus norvegicus (Rat))
Universit£
Curated by ChEMBL
LigandPNGBDBM50036854(1-(5-Methoxy-chroman-3-yl)-pyrrolidine | CHEMBL285...)
Affinity DataIC50:  1.00E+5nM. Assay description: Binding affinity for 5-hydroxytryptamine 1B receptor in rat cortex, striatum and globus pallidus
In DepthDetails ArticlePubMed
TargetD(2) dopamine receptor(BOVINE)
Universit£
Curated by ChEMBL
LigandPNGBDBM50036854(1-(5-Methoxy-chroman-3-yl)-pyrrolidine | CHEMBL285...)
Affinity DataIC50:  2.50E+3nM. Assay description: Binding affinity against D2 receptor in calf caudate nucleus
In DepthDetails ArticlePubMed
Target5-hydroxytryptamine receptor 1A(Rattus norvegicus (rat))
Universit£
Curated by ChEMBL
LigandPNGBDBM50036854(1-(5-Methoxy-chroman-3-yl)-pyrrolidine | CHEMBL285...)
Affinity DataIC50:  7nM. Assay description: Binding affinity against 5-hydroxytryptamine 1A (5-HT1A) receptor in rat hippocampus membranes
In DepthDetails ArticlePubMed
TargetAlpha-2A adrenergic receptor(BOVINE)
Universit£
Curated by ChEMBL
LigandPNGBDBM50036854(1-(5-Methoxy-chroman-3-yl)-pyrrolidine | CHEMBL285...)
Affinity DataIC50:  3.00E+3nM. Assay description: Binding affinity against alpha-2 adrenergic receptor in calf frontal cortex
In DepthDetails ArticlePubMed