BDBM50037620 3-(2,4-Difluoro-phenyl)-1-[3-(4,5-diphenyl-1H-imidazol-2-ylsulfanylmethyl)-benzyl]-1-heptyl-urea::CHEMBL115682
SMILES CCCCCCCN(Cc1cccc(CSc2nc(c([nH]2)-c2ccccc2)-c2ccccc2)c1)C(=O)Nc1ccc(F)cc1F
InChI Key InChIKey=KPJUSGHCRPCLEN-UHFFFAOYSA-N
Data  1 IC50
  Tab Delimited (TSV)   2D SDfile   Computed 3D by Vconf -m prep SDfile
Find this compound or compounds like it in BindingDB:
Activity Spreadsheet -- Enzyme Inhibition Constant Data from BindingDB
Found 1 hit for monomerid = 50037620
TargetSterol O-acyltransferase 1(Rattus norvegicus)
Dupont Pharmaceuticals
Curated by ChEMBL
LigandPNGBDBM50037620(3-(2,4-Difluoro-phenyl)-1-[3-(4,5-diphenyl-1H-imid...)
Affinity DataIC50:  30nM. Assay description: In vitro inhibition of Acyl coenzyme A:cholesterol acyltransferase in rat hepatic microsomes
In DepthDetails ArticlePubMed