BDBM50037665 1-[5-(4,5-Diphenyl-1H-imidazol-2-ylsulfanyl)-pentyl]-1-heptyl-3-isopropyl-urea::CHEMBL119369
SMILES CCCCCCCN(CCCCCSc1nc(c([nH]1)-c1ccccc1)-c1ccccc1)C(=O)NC(C)C
InChI Key InChIKey=RDHBMHSNHWJBEJ-UHFFFAOYSA-N
Data  1 IC50
  Tab Delimited (TSV)   2D SDfile   Computed 3D by Vconf -m prep SDfile
Find this compound or compounds like it in BindingDB:
Activity Spreadsheet -- Enzyme Inhibition Constant Data from BindingDB
Found 1 hit for monomerid = 50037665
TargetSterol O-acyltransferase 1(Rattus norvegicus)
Dupont Pharmaceuticals
Curated by ChEMBL
LigandPNGBDBM50037665(1-[5-(4,5-Diphenyl-1H-imidazol-2-ylsulfanyl)-penty...)
Affinity DataIC50:  20nM. Assay description: In vitro inhibition of Acyl coenzyme A:cholesterol acyltransferase in rat hepatic microsomes
In DepthDetails ArticlePubMed