BDBM50038760 6-Fluoro-3-((R)-2-pyridin-3-yl-thiazolidine-4-carbonyl)-indole-1-carboxylic acid dimethylamide::CHEMBL63383
SMILES CN(C)C(=O)n1cc(C(=O)[C@@H]2CSC(N2)c2cccnc2)c2ccc(F)cc12
InChI Key InChIKey=SZVLRTNGEYQGMF-UCFFOFKASA-N
Data  1 KI
  Tab Delimited (TSV)   2D SDfile   Computed 3D by Vconf -m prep SDfile
Find this compound or compounds like it in BindingDB:
Activity Spreadsheet -- Enzyme Inhibition Constant Data from BindingDB
Found 1 hit for monomerid = 50038760
TargetPlatelet-activating factor receptor(Cavia porcellus)
Abbott Laboratories
Curated by ChEMBL
LigandPNGBDBM50038760(6-Fluoro-3-((R)-2-pyridin-3-yl-thiazolidine-4-carb...)
Affinity DataKi:  1.90nM. Assay description: Antagonist activity against platelet activating factor (PAF) receptor in rabbit platelet membranes using [3H]C18-PAF as radioligand
In DepthDetails ArticlePubMed