BDBM50038801 CHEMBL62830::[6-(4-Fluoro-benzyloxy)-1H-indol-3-yl]-((R)-2-pyridin-3-yl-thiazolidin-4-yl)-methanone
SMILES Fc1ccc(COc2ccc3c(c[nH]c3c2)C(=O)[C@@H]2CSC(N2)c2cccnc2)cc1
InChI Key InChIKey=DQNZOASLTKPJHJ-OWJIYDKWSA-N
Data  1 KI
  Tab Delimited (TSV)   2D SDfile   Computed 3D by Vconf -m prep SDfile
Find this compound or compounds like it in BindingDB:
Activity Spreadsheet -- Enzyme Inhibition Constant Data from BindingDB
Found 1 hit for monomerid = 50038801
TargetPlatelet-activating factor receptor(Cavia porcellus)
Abbott Laboratories
Curated by ChEMBL
LigandPNGBDBM50038801(CHEMBL62830 | [6-(4-Fluoro-benzyloxy)-1H-indol-3-y...)
Affinity DataKi:  1.60nM. Assay description: Antagonist activity against platelet activating factor (PAF) receptor in rabbit platelet membranes using [3H]C18-PAF as radioligand
In DepthDetails ArticlePubMed