BDBM50038865 2-Benzofuran-2-yl-1-[(R)-2-(pyrrolidine-1-carbonyl)-pyrrolidin-1-yl]-ethanone::CHEMBL304892
SMILES O=C(Cc1cc2ccccc2o1)N1CCC[C@@H]1C(=O)N1CCCC1
InChI Key InChIKey=SUCCKSYEEMWBIE-MRXNPFEDSA-N
Data  1 IC50
  Tab Delimited (TSV)   2D SDfile   Computed 3D by Vconf -m prep SDfile
Find this compound or compounds like it in BindingDB:
Activity Spreadsheet -- Enzyme Inhibition Constant Data from BindingDB
Found 1 hit for monomerid = 50038865
TargetProlyl endopeptidase(Homo sapiens (Human))
Zeria Pharmaceutical
Curated by ChEMBL
LigandPNGBDBM50038865(2-Benzofuran-2-yl-1-[(R)-2-(pyrrolidine-1-carbonyl...)
Affinity DataIC50:  510nM. Assay description: In vitro inhibitory activity against purified prolyl endopeptidase (PEP) from canine brain.
In DepthDetails ArticlePubMed