BDBM50039546 7-Pyridin-3-ylmethyl-3,5-dihydro-pyrrolo[3,2-d]pyrimidin-4-one::CHEMBL83053
SMILES O=c1[nH]cnc2c(Cc3cccnc3)c[nH]c12
InChI Key InChIKey=HFPSHRVJTXLPIA-UHFFFAOYSA-N
Data  1 IC50
  Tab Delimited (TSV)   2D SDfile   Computed 3D by Vconf -m prep SDfile
Find this compound or compounds like it in BindingDB:
Activity Spreadsheet -- Enzyme Inhibition Constant Data from BindingDB
Found 1 hit for monomerid = 50039546
TargetPurine nucleoside phosphorylase(Rattus norvegicus)
Southern Research Institute
Curated by ChEMBL
LigandPNGBDBM50039546(7-Pyridin-3-ylmethyl-3,5-dihydro-pyrrolo[3,2-d]pyr...)
Affinity DataIC50:  40nM. Assay description: Tested for its ability to inhibit calf spleen purine nucleoside phosphorylase (PNP)
In DepthDetails ArticlePubMed