BDBM50039572 (S)-2-Pentanoylamino-3-[4-(4-piperidin-4-yl-butoxy)-phenyl]-propionic acid::CHEMBL432381
SMILES CCCCC(=O)N[C@@H](Cc1ccc(OCCCCC2CCNCC2)cc1)C(O)=O
InChI Key InChIKey=WCRSXUOLWFUOFH-NRFANRHFSA-N
Data  1 IC50
  Tab Delimited (TSV)   2D SDfile   Computed 3D by Vconf -m prep SDfile
Find this compound or compounds like it in BindingDB:
Activity Spreadsheet -- Enzyme Inhibition Constant Data from BindingDB
Found 1 hit for monomerid = 50039572
TargetIntegrin alpha-IIb/beta-3(Homo sapiens (Human))
Merck Research Laboratories
Curated by ChEMBL
LigandPNGBDBM50039572((S)-2-Pentanoylamino-3-[4-(4-piperidin-4-yl-butoxy...)
Affinity DataIC50:  47nM. Assay description: Inhibition of platelet aggregation as the concentration necessary to inhibit the change in light .
In DepthDetails ArticlePubMed