BDBM50039581 (S)-2-Hexanoylamino-3-[4-(5-piperidin-4-yl-pentyl)-phenyl]-propionic acid::CHEMBL86131
SMILES CCCCCC(=O)N[C@@H](Cc1ccc(CCCCCC2CCNCC2)cc1)C(O)=O
InChI Key InChIKey=DZYIMYFWSGXZFR-QHCPKHFHSA-N
Data  1 IC50
  Tab Delimited (TSV)   2D SDfile   Computed 3D by Vconf -m prep SDfile
Find this compound or compounds like it in BindingDB:
Activity Spreadsheet -- Enzyme Inhibition Constant Data from BindingDB
Found 1 hit for monomerid = 50039581
TargetIntegrin alpha-IIb/beta-3(Homo sapiens (Human))
Merck Research Laboratories
Curated by ChEMBL
LigandPNGBDBM50039581((S)-2-Hexanoylamino-3-[4-(5-piperidin-4-yl-pentyl)...)
Affinity DataIC50:  1.50E+3nM. Assay description: Inhibition of platelet aggregation as the concentration necessary to inhibit the change in light .
In DepthDetails ArticlePubMed