BDBM50039583 3-[4-(4-Piperidin-4-yl-butoxy)-phenyl]-propionic acid::CHEMBL87560
SMILES OC(=O)CCc1ccc(OCCCCC2CCNCC2)cc1
InChI Key InChIKey=QGYSOUNOYAAGCM-UHFFFAOYSA-N
Data  1 IC50
  Tab Delimited (TSV)   2D SDfile   Computed 3D by Vconf -m prep SDfile
Find this compound or compounds like it in BindingDB:
Activity Spreadsheet -- Enzyme Inhibition Constant Data from BindingDB
Found 1 hit for monomerid = 50039583
TargetIntegrin alpha-IIb/beta-3(Homo sapiens (Human))
Merck Research Laboratories
Curated by ChEMBL
LigandPNGBDBM50039583(3-[4-(4-Piperidin-4-yl-butoxy)-phenyl]-propionic a...)
Affinity DataIC50:  2.40E+4nM. Assay description: Inhibition of platelet aggregation as the concentration necessary to inhibit the change in light .
In DepthDetails ArticlePubMed